Target
Serine/threonine-protein kinase PLK4
Ligand
BDBM50437839
Substrate
Meas. Tech.
ChEMBL_973993 (CHEMBL2410318)
IC50
290±n/a nM
Citation
 Laufer, RForrest, BLi, SWLiu, YSampson, PEdwards, LLang, YAwrey, DEMao, GPlotnikova, OLeung, GHodgson, RBeletskaya, IMason, JMLuo, XWei, XYao, YFeher, MBan, FKiarash, RGreen, EMak, TWPan, GPauls, HW The discovery of PLK4 inhibitors: (E)-3-((1H-Indazol-6-yl)methylene)indolin-2-ones as novel antiproliferative agents. J Med Chem 56:6069-87 (2013)  
Target
Name:
Serine/threonine-protein kinase PLK4
Synonyms:
PLK4 Polo-Like Kinase 4 STK18 | Serine/threonine-protein kinase PLK4
Type:
PROTEIN
Mol. Mass.:
108996.91
Organism:
Homo sapiens (Human)
Description:
ChEMBL_1474078
Residue:
970
  
Inhibitor
Name:
BDBM50437839
Synonyms:
CHEMBL2407911
Type:
Small organic molecule
Emp. Form.:
C16H11N3O
Mol. Mass.:
261.278
SMILES:
O=C1Nc2ccccc2\C1=C/c1ccc2cn[nH]c2c1
: