Target
Intestinal-type alkaline phosphatase
Ligand
BDBM50437944
Substrate
Meas. Tech.
ChEMBL_972808 (CHEMBL2411276)
Ki
5100±n/a nM
Citation
 al-Rashida, MRaza, RAbbas, GShah, MSKostakis, GELecka, JSévigny, JMuddassar, MPapatriantafyllopoulou, CIqbal, J Identification of novel chromone based sulfonamides as highly potent and selective inhibitors of alkaline phosphatases. Eur J Med Chem 66:438-49 (2013)  
Target
Name:
Intestinal-type alkaline phosphatase
Synonyms:
ALPI Intestinal alkaline phosphatase (IAP) PPBI_BOVIN
Type:
Protein
Mol. Mass.:
57094.82
Organism:
Bos taurus (Cattle)
Description:
P19111
Residue:
533
  
Inhibitor
Name:
BDBM50437944
Synonyms:
CHEMBL1814394
Type:
Small organic molecule
Emp. Form.:
C18H16Br2N2O5S
Mol. Mass.:
532.203
SMILES:
CCOC1Oc2c(Br)cc(Br)cc2C(=O)C1=CNc1ccc(cc1)S(N)(=O)=O
: