Target
Kallikrein-5 [D153N]
Ligand
BDBM50438170
Substrate
Meas. Tech.
ChEMBL_973069 (CHEMBL2412650)
IC50
>30000±n/a nM
Citation
 Tan, XFurio, LReboud-Ravaux, MVilloutreix, BOHovnanian, AEl Amri, C 1,2,4-Triazole derivatives as transient inactivators of kallikreins involved in skin diseases. Bioorg Med Chem Lett 23:4547-51 (2013)  
Target
Name:
Kallikrein-5 [D153N]
Synonyms:
KLK-L2 KLK5_HUMAN Kallikrein-5 SCTE | Stratum corneum tryptic enzyme
Type:
PROTEIN
Mol. Mass.:
32031.75
Organism:
Homo sapiens (Human)
Description:
ChEMBL_1282456
Residue:
293
  
Inhibitor
Name:
BDBM50438170
Synonyms:
CHEMBL2407437
Type:
Small organic molecule
Emp. Form.:
C14H9Cl2N5O
Mol. Mass.:
334.16
SMILES:
Nc1nc(nn1C(=O)c1ccc(Cl)cc1Cl)-c1cccnc1
: