Target
Kallikrein-7
Ligand
BDBM32709
Substrate
Meas. Tech.
ChEMBL_973068 (CHEMBL2412649)
IC50
40±n/a nM
Citation
 Tan, XFurio, LReboud-Ravaux, MVilloutreix, BOHovnanian, AEl Amri, C 1,2,4-Triazole derivatives as transient inactivators of kallikreins involved in skin diseases. Bioorg Med Chem Lett 23:4547-51 (2013)  
Target
Name:
Kallikrein-7
Synonyms:
KLK7 Kallikrein 7 PRSS6 Serine protease 6 hK7 kallikrein-7 isoform 1 preproprotein
Type:
PROTEIN
Mol. Mass.:
27535.05
Organism:
Homo sapiens (Human)
Description:
ChEMBL_1469257
Residue:
253
  
Inhibitor
Name:
BDBM32709
Synonyms:
(5-amino-3-pyridin-3-yl-1,2,4-triazol-1-yl)-(4-methylphenyl)methanone 1-(4-methylbenzoyl)-3-(3-pyridinyl)-1H-1,2,4-triazol-5-amine SMR000144080 [5-amino-3-(3-pyridyl)-1,2,4-triazol-1-yl]-(p-tolyl)methanone | cid_970375
Type:
Small organic molecule
Emp. Form.:
C15H13N5O
Mol. Mass.:
279.2966
SMILES:
Cc1ccc(cc1)C(=O)n1nc(nc1N)-c1cccnc1
: