Target
Mitogen-activated protein kinase kinase kinase 7
Ligand
BDBM50438223
Substrate
Meas. Tech.
ChEMBL_973092 (CHEMBL2412855)
IC50
10.0±n/a nM
Citation
 Hornberger, KRBerger, DMCrew, APDong, HKleinberg, ALi, AHMedeiros, MRMulvihill, MJSiu, KTarrant, JWang, JWeng, FWilde, VLAlbertella, MBittner, MCooke, AGray, MJMaresca, PMay, EMeyn, PPeick, WRomashko, DTanowitz, MTokar, B Discovery and optimization of 7-aminofuro[2,3-c]pyridine inhibitors of TAK1. Bioorg Med Chem Lett 23:4517-22 (2013)  
Target
Name:
Mitogen-activated protein kinase kinase kinase 7
Synonyms:
M3K7_HUMAN Mitogen-activated protein kinase kinase kinase 7 TAK1/TAB1 Transforming growth factor-beta-activated kinase 1 (TAK1)
Type:
Protein
Mol. Mass.:
67199.89
Organism:
Homo sapiens (Human)
Description:
O43318
Residue:
606
  
Inhibitor
Name:
BDBM50438223
Synonyms:
CHEMBL2407758
Type:
Small organic molecule
Emp. Form.:
C24H22N6O2S
Mol. Mass.:
458.535
SMILES:
CC(=O)N1CCC(CC1)n1cc(cn1)-c1cnc(N)c2oc(cc12)-c1cccc2ncsc12
: