Target
Sigma non-opioid intracellular receptor 1
Ligand
BDBM50374600
Substrate
Meas. Tech.
ChEMBL_976148 (CHEMBL2415797)
Ki
0.560000±n/a nM
Citation
 Bhat, RFishback, JAMatsumoto, RRPoupaert, JHMcCurdy, CR Structure activity relationship study of benzo[d]thiazol-2(3H)one baseds receptor ligands. Bioorg Med Chem Lett 23:5011-3 (2013)  
Target
Name:
Sigma non-opioid intracellular receptor 1
Synonyms:
OPRS1 SIGMAR1 Sigma non-opioid intracellular receptor 1 Sigma1-receptor Sterol isomerase-like protein
Type:
Protein
Mol. Mass.:
25307.17
Organism:
Cavia porcellus (Guinea pig)
Description:
Q60492
Residue:
223
  
Inhibitor
Name:
BDBM50374600
Synonyms:
CHEMBL272899
Type:
Small organic molecule
Emp. Form.:
C18H26N2OS
Mol. Mass.:
318.477
SMILES:
CCCc1ccc2n(CCN3CCCCCC3)c(=O)sc2c1
: