Target
Tyrosine-protein kinase JAK2
Ligand
BDBM99582
Substrate
Meas. Tech.
ChEMBL_976252 (CHEMBL2415137)
Ki
0.300000±n/a nM
Citation
 Siu, MPastor, RLiu, WBarrett, KBerry, MBlair, WSChang, CChen, JZEigenbrot, CGhilardi, NGibbons, PHe, HHurley, CAKenny, JRCyrus Khojasteh, SLe, HLee, LLyssikatos, JPMagnuson, SPulk, RTsui, VUltsch, MXiao, YZhu, BYSampath, D 2-Amino-[1,2,4]triazolo[1,5-a]pyridines as JAK2 inhibitors. Bioorg Med Chem Lett 23:5014-21 (2013)  
Target
Name:
Tyrosine-protein kinase JAK2
Synonyms:
JAK-2 JAK2_HUMAN Janus kinase 2 (JAK2) | Janus kinase 2 (a protein tyrosine kinase)
Type:
Protein
Mol. Mass.:
130684.68
Organism:
Homo sapiens (Human)
Description:
O60674
Residue:
1132
  
Inhibitor
Name:
BDBM99582
Synonyms:
US8501936, 81
Type:
Small organic molecule
Emp. Form.:
C24H26N6O2S
Mol. Mass.:
462.567
SMILES:
CN1CCN(CC1)c1ccc(Nc2nc3cccc(-c4ccc(cc4)S(C)(=O)=O)n3n2)cc1
: