Target
Diacylglycerol O-acyltransferase 1
Ligand
BDBM50438697
Substrate
Meas. Tech.
ChEMBL_976374 (CHEMBL2415510)
IC50
92100±n/a nM
Citation
 Dow, RLAndrews, MPLi, JCMichael Gibbs, EGuzman-Perez, ALaperle, JLLi, QMather, DMunchhof, MJNiosi, MPatel, LPerreault, CTapley, SZavadoski, WJ Defining the key pharmacophore elements of PF-04620110: discovery of a potent, orally-active, neutral DGAT-1 inhibitor. Bioorg Med Chem 21:5081-97 (2013)  
Target
Name:
Diacylglycerol O-acyltransferase 1
Synonyms:
ACAT-related gene product 1 Acyl coA-diacylglycerol acyl transferase 1 (DGAT1) DGAT1 Diacylglycerol Acyltransferase (DGAT1) Diacylglycerol O-acyltransferase 1 (DGAT1) | Diglyceride acyltransferase
Type:
Protein
Mol. Mass.:
55297.82
Organism:
Homo sapiens (Human)
Description:
O75907
Residue:
488
  
Inhibitor
Name:
BDBM50438697
Synonyms:
CHEMBL2414693
Type:
Small organic molecule
Emp. Form.:
C12H16N4O2
Mol. Mass.:
248.281
SMILES:
Nc1ncnc2OCCN(C3CCCC3)C(=O)c12
: