Target
Diacylglycerol O-acyltransferase 1
Ligand
BDBM50438732
Substrate
Meas. Tech.
ChEMBL_976373 (CHEMBL2415509)
IC50
66±n/a nM
Citation
 Dow, RLAndrews, MPLi, JCMichael Gibbs, EGuzman-Perez, ALaperle, JLLi, QMather, DMunchhof, MJNiosi, MPatel, LPerreault, CTapley, SZavadoski, WJ Defining the key pharmacophore elements of PF-04620110: discovery of a potent, orally-active, neutral DGAT-1 inhibitor. Bioorg Med Chem 21:5081-97 (2013)  
Target
Name:
Diacylglycerol O-acyltransferase 1
Synonyms:
ACAT-related gene product 1 Acyl coA-diacylglycerol acyl transferase 1 (DGAT1) DGAT1 Diacylglycerol Acyltransferase (DGAT1) Diacylglycerol O-acyltransferase 1 (DGAT1) | Diglyceride acyltransferase
Type:
Protein
Mol. Mass.:
55297.82
Organism:
Homo sapiens (Human)
Description:
O75907
Residue:
488
  
Inhibitor
Name:
BDBM50438732
Synonyms:
CHEMBL2414656
Type:
Small organic molecule
Emp. Form.:
C27H35N5O4
Mol. Mass.:
493.5979
SMILES:
COC1CCN(CC1)C(=O)C[C@H]1CC[C@@H](CC1)c1ccc(cc1)N1CCOc2ncnc(N)c2C1=O
: