Target
Diacylglycerol O-acyltransferase 2
Ligand
BDBM50438735
Substrate
Meas. Tech.
ChEMBL_976298 (CHEMBL2415206)
IC50
>30000±n/a nM
Citation
 Dow, RLAndrews, MPLi, JCMichael Gibbs, EGuzman-Perez, ALaperle, JLLi, QMather, DMunchhof, MJNiosi, MPatel, LPerreault, CTapley, SZavadoski, WJ Defining the key pharmacophore elements of PF-04620110: discovery of a potent, orally-active, neutral DGAT-1 inhibitor. Bioorg Med Chem 21:5081-97 (2013)  
Target
Name:
Diacylglycerol O-acyltransferase 2
Synonyms:
ARAT DGAT2 Diacylglycerol O-acyltransferase 2 (DGAT2) Retinol O-fatty-acyltransferase
Type:
Multi-pass membrane protein
Mol. Mass.:
43848.90
Organism:
Homo sapiens (Human)
Description:
Q96PD7
Residue:
388
  
Inhibitor
Name:
BDBM50438735
Synonyms:
CHEMBL2414670
Type:
Small organic molecule
Emp. Form.:
C23H26N6O3
Mol. Mass.:
434.4909
SMILES:
Cc1noc(C[C@H]2CC[C@@H](CC2)c2ccc(cc2)N2CCOc3ncnc(N)c3C2=O)n1
: