Target
E3 ubiquitin-protein ligase XIAP
Ligand
BDBM13174
Substrate
Meas. Tech.
ChEMBL_976636 (CHEMBL2416968)
Kd
5.0±n/a nM
Citation
 Elsawy, MAMartin, LTikhonova, IGWalker, B Solid phase synthesis of Smac/DIABLO-derived peptides using a 'Safety-Catch' resin: identification of potent XIAP BIR3 antagonists. Bioorg Med Chem 21:5004-11 (2013)  
Target
Name:
E3 ubiquitin-protein ligase XIAP
Synonyms:
API3 E3 ubiquitin-protein ligase XIAP Inhibitor of apoptosis protein 3 X-linked inhibitor of apoptosis XIAP | XIAP_HUMAN
Type:
Protein
Mol. Mass.:
56685.27
Organism:
Homo sapiens (Human)
Description:
P98170
Residue:
497
  
Inhibitor
Name:
BDBM13174
Synonyms:
(2S,4S)-1-[(2S)-3,3-dimethyl-2-[(2S)-2-(methylamino)propanamido]butanoyl]-4-phenoxy-N-[(1R)-1,2,3,4-tetrahydronaphthalen-1-yl]pyrrolidine-2-carboxamide H-N-Me-Ala-Tle-(4S)-4-phenoxy-Pro-(R)-tetrahydronaphth-1-yl Amide
Type:
Small organic molecule
Emp. Form.:
C31H42N4O4
Mol. Mass.:
534.6896
SMILES:
CN[C@@H](C)C(=O)N[C@H](C(=O)N1C[C@H](C[C@H]1C(=O)N[C@@H]1CCCc2ccccc12)Oc1ccccc1)C(C)(C)C
: