Target
Nicotinamide phosphoribosyltransferase
Ligand
BDBM50438987
Substrate
Meas. Tech.
ChEMBL_978889 (CHEMBL2423680)
IC50
9.0±n/a nM
Citation
 Zheng, XBauer, PBaumeister, TBuckmelter, AJCaligiuri, MClodfelter, KHHan, BHo, YCKley, NLin, JReynolds, DJSharma, GSmith, CCWang, ZDragovich, PSGunzner-Toste, JLiederer, BMLy, JO'Brien, TOh, AWang, LWang, WXiao, YZak, MZhao, GYuen, PWBair, KW Structure-based discovery of novel amide-containing nicotinamide phosphoribosyltransferase (nampt) inhibitors. J Med Chem 56:6413-33 (2013)  
Target
Name:
Nicotinamide phosphoribosyltransferase
Synonyms:
NAMPT NAmPRTase Nicotinamide phosphoribosyltransferase (NAMPT) PBEF1 | Pre-B-cell colony-enhancing factor 1
Type:
Enzyme
Mol. Mass.:
55524.98
Organism:
Homo sapiens (Human)
Description:
P43490
Residue:
491
  
Inhibitor
Name:
BDBM50438987
Synonyms:
CHEMBL2420670
Type:
Small organic molecule
Emp. Form.:
C20H22N4O3S
Mol. Mass.:
398.479
SMILES:
O=C(NCc1ccc(cc1)S(=O)(=O)N1CCCCC1)c1cc2cnccc2[nH]1
: