Target
N-acylethanolamine-hydrolyzing acid amidase
Ligand
BDBM50439665
Substrate
Meas. Tech.
ChEMBL_978417 (CHEMBL2421059)
IC50
20±n/a nM
Citation
 Ponzano, SBertozzi, FMengatto, LDionisi, MArmirotti, ARomeo, EBerteotti, AFiorelli, CTarozzo, GReggiani, ADuranti, ATarzia, GMor, MCavalli, APiomelli, DBandiera, T Synthesis and structure-activity relationship (SAR) of 2-methyl-4-oxo-3-oxetanylcarbamic acid esters, a class of potent N-acylethanolamine acid amidase (NAAA) inhibitors. J Med Chem 56:6917-34 (2013)  
Target
Name:
N-acylethanolamine-hydrolyzing acid amidase
Synonyms:
ASAH-like protein N-acylethanolamine acid amidase (NAAA) N-acylethanolamine-hydrolyzing acid amidase (NAAA) N-acylethanolamine-hydrolyzing acid amidase subunit beta NAAA_RAT | Naaa
Type:
Enzyme
Mol. Mass.:
40306.53
Organism:
Rattus norvegicus (Rat)
Description:
Q5KTC7
Residue:
362
  
Inhibitor
Name:
BDBM50439665
Synonyms:
CHEMBL2419819 | US9353075, 38
Type:
Small organic molecule
Emp. Form.:
C16H21NO4
Mol. Mass.:
291.3422
SMILES:
C[C@H]1OC(=O)[C@@H]1NC(=O)OCCCCCc1ccccc1
: