Target
G-protein coupled receptor 35
Ligand
BDBM50440043
Substrate
Meas. Tech.
ChEMBL_982934 (CHEMBL2429574)
Ki
1.9±n/a nM
Citation
 Thimm, DFunke, MMeyer, AMüller, CE 6-Bromo-8-(4-[(3)H]methoxybenzamido)-4-oxo-4H-chromene-2-carboxylic Acid: a powerful tool for studying orphan G protein-coupled receptor GPR35. J Med Chem 56:7084-99 (2013)  
Target
Name:
G-protein coupled receptor 35
Synonyms:
G protein-coupled receptor 35 GPR35_HUMAN
Type:
Enzyme Catalytic Domain
Mol. Mass.:
34085.57
Organism:
Homo sapiens (Human)
Description:
gi_33695097
Residue:
309
  
Inhibitor
Name:
BDBM50440043
Synonyms:
CHEMBL2425824
Type:
Small organic molecule
Emp. Form.:
C18H11ClFNO6
Mol. Mass.:
391.734
SMILES:
COc1ccc(C(=O)Nc2cc(Cl)cc3c2oc(cc3=O)C(O)=O)c(F)c1
: