Target
G-protein coupled receptor 35
Ligand
BDBM50436003
Substrate
Meas. Tech.
ChEMBL_982934 (CHEMBL2429574)
Ki
2.2±n/a nM
Citation
 Thimm, DFunke, MMeyer, AMüller, CE 6-Bromo-8-(4-[(3)H]methoxybenzamido)-4-oxo-4H-chromene-2-carboxylic Acid: a powerful tool for studying orphan G protein-coupled receptor GPR35. J Med Chem 56:7084-99 (2013)  
Target
Name:
G-protein coupled receptor 35
Synonyms:
G protein-coupled receptor 35 GPR35_HUMAN
Type:
Enzyme Catalytic Domain
Mol. Mass.:
34085.57
Organism:
Homo sapiens (Human)
Description:
gi_33695097
Residue:
309
  
Inhibitor
Name:
BDBM50436003
Synonyms:
CHEMBL2392172
Type:
Small organic molecule
Emp. Form.:
C17H8BrCl2NO5
Mol. Mass.:
457.059
SMILES:
OC(=O)c1cc(=O)c2cc(Br)cc(NC(=O)c3ccc(Cl)c(Cl)c3)c2o1
: