Target
Glutamate receptor ionotropic, NMDA 2C
Ligand
BDBM50440059
Substrate
Meas. Tech.
ChEMBL_983748 (CHEMBL2427901)
IC50
2100±n/a nM
Citation
 Acker, TMKhatri, AVance, KMSlabber, CBacsa, JSnyder, JPTraynelis, SFLiotta, DC Structure-activity relationships and pharmacophore model of a noncompetitive pyrazoline containing class of GluN2C/GluN2D selective antagonists. J Med Chem 56:6434-56 (2013)  
Target
Name:
Glutamate receptor ionotropic, NMDA 2C
Synonyms:
Glutamate NMDA receptor; Grin1/Grin2c Grin2c NMDE3_RAT
Type:
Protein
Mol. Mass.:
135305.94
Organism:
Rattus norvegicus (Rat)
Description:
Q00961
Residue:
1237
  
Inhibitor
Name:
BDBM50440059
Synonyms:
CHEMBL2426082
Type:
Small organic molecule
Emp. Form.:
C28H21Cl2N3O4
Mol. Mass.:
534.39
SMILES:
OC(=O)CCC(=O)N1N=C(C[C@@H]1c1ccc(Cl)cc1)c1c(-c2ccc(Cl)cc2)c2ccccc2[nH]c1=O
: