Target
Virulence factor transcriptional regulator MvfR
Ligand
BDBM50440127
Substrate
Meas. Tech.
ChEMBL_980942 (CHEMBL2427495)
Kd
12900±n/a nM
Citation
 Zender, MKlein, THenn, CKirsch, BMaurer, CKKail, DRitter, CDolezal, OSteinbach, AHartmann, RW Discovery and biophysical characterization of 2-amino-oxadiazoles as novel antagonists of PqsR, an important regulator of Pseudomonas aeruginosa virulence. J Med Chem 56:6761-74 (2013)  
Target
Name:
Virulence factor transcriptional regulator MvfR
Synonyms:
Transcriptional regulator MvfR
Type:
PROTEIN
Mol. Mass.:
37217.11
Organism:
Pseudomonas aeruginosa PA14
Description:
ChEMBL_107649
Residue:
332
  
Inhibitor
Name:
BDBM50440127
Synonyms:
CHEMBL2426238
Type:
Small organic molecule
Emp. Form.:
C10H7F3N2O
Mol. Mass.:
228.1706
SMILES:
Cc1nnc(o1)-c1cccc(c1)C(F)(F)F
: