Target
Virulence factor transcriptional regulator MvfR
Ligand
BDBM50440128
Substrate
Meas. Tech.
ChEMBL_980942 (CHEMBL2427495)
Kd
8500±n/a nM
Citation
 Zender, MKlein, THenn, CKirsch, BMaurer, CKKail, DRitter, CDolezal, OSteinbach, AHartmann, RW Discovery and biophysical characterization of 2-amino-oxadiazoles as novel antagonists of PqsR, an important regulator of Pseudomonas aeruginosa virulence. J Med Chem 56:6761-74 (2013)  
Target
Name:
Virulence factor transcriptional regulator MvfR
Synonyms:
Transcriptional regulator MvfR
Type:
PROTEIN
Mol. Mass.:
37217.11
Organism:
Pseudomonas aeruginosa PA14
Description:
ChEMBL_107649
Residue:
332
  
Inhibitor
Name:
BDBM50440128
Synonyms:
CHEMBL1545380
Type:
Small organic molecule
Emp. Form.:
C8H5F3N2S
Mol. Mass.:
218.199
SMILES:
FC(F)(F)c1cc(n[nH]1)-c1cccs1
: