Target
Deoxycytidine kinase
Ligand
BDBM50440172
Substrate
Meas. Tech.
ChEMBL_981462 (CHEMBL2428640)
Ki
0.500000±n/a nM
Citation
 Murphy, JMArmijo, ALNomme, JLee, CHSmith, QALi, ZCampbell, DOLiao, HINathanson, DAAustin, WRLee, JTDarvish, RWei, LWang, JSu, YDamoiseaux, RSadeghi, SPhelps, MEHerschman, HRCzernin, JAlexandrova, ANJung, MELavie, ARadu, CG Development of new deoxycytidine kinase inhibitors and noninvasive in vivo evaluation using positron emission tomography. J Med Chem 56:6696-708 (2013)  
Target
Name:
Deoxycytidine kinase
Synonyms:
DCK | DCK_HUMAN
Type:
PROTEIN
Mol. Mass.:
30510.65
Organism:
Homo sapiens (Human)
Description:
ChEMBL_1437135
Residue:
260
  
Inhibitor
Name:
BDBM50440172
Synonyms:
CHEMBL2426574
Type:
Small organic molecule
Emp. Form.:
C21H28N6O4S3
Mol. Mass.:
524.68
SMILES:
CCCc1sc(nc1CSc1nc(N)cc(N)n1)-c1ccc(OC)c(OCCNS(C)(=O)=O)c1
: