Target
Lysine-specific demethylase 4C
Ligand
BDBM50440285
Substrate
Meas. Tech.
ChEMBL_982484 (CHEMBL2427610)
IC50
22000±n/a nM
Citation
 Suzuki, TOzasa, HItoh, YZhan, PSawada, HMino, KWalport, LOhkubo, RKawamura, AYonezawa, MTsukada, YTumber, ANakagawa, HHasegawa, MSasaki, RMizukami, TSchofield, CJMiyata, N Identification of the KDM2/7 histone lysine demethylase subfamily inhibitor and its antiproliferative activity. J Med Chem 56:7222-31 (2013)  
Target
Name:
Lysine-specific demethylase 4C
Synonyms:
GASC-1 protein Gene amplified in squamous cell carcinoma 1 protein JMJD2C Jumonji domain-containing protein 2C KDM4C_HUMAN | KIAA0780
Type:
Protein
Mol. Mass.:
119979.01
Organism:
Homo sapiens (Human)
Description:
Q9H3R0
Residue:
1056
  
Inhibitor
Name:
BDBM50440285
Synonyms:
CHEMBL2424816
Type:
Small organic molecule
Emp. Form.:
C18H27NO4
Mol. Mass.:
321.4113
SMILES:
ON(CCC(O)=O)C(=O)CCCCCCCCc1ccccc1
: