Target
Lysine-specific demethylase 4A
Ligand
BDBM50440289
Substrate
Meas. Tech.
ChEMBL_982483 (CHEMBL2427609)
IC50
>120000±n/a nM
Citation
 Suzuki, TOzasa, HItoh, YZhan, PSawada, HMino, KWalport, LOhkubo, RKawamura, AYonezawa, MTsukada, YTumber, ANakagawa, HHasegawa, MSasaki, RMizukami, TSchofield, CJMiyata, N Identification of the KDM2/7 histone lysine demethylase subfamily inhibitor and its antiproliferative activity. J Med Chem 56:7222-31 (2013)  
Target
Name:
Lysine-specific demethylase 4A
Synonyms:
JHDM3A JMJD2A Jumonji domain-containing protein 2A KDM4A_HUMAN Lysine-specific demethylase 4A | Lysine-specific demethylase 4A (KDM4A)
Type:
Enzyme
Mol. Mass.:
120647.83
Organism:
Homo sapiens (Human)
Description:
O75164
Residue:
1064
  
Inhibitor
Name:
BDBM50440289
Synonyms:
CHEMBL2424812
Type:
Small organic molecule
Emp. Form.:
C15H27NO4
Mol. Mass.:
285.3792
SMILES:
ON(CCC(O)=O)C(=O)CCCCCCCCC1CC1
: