Target
Telomerase reverse transcriptase
Ligand
BDBM50068304
Substrate
Meas. Tech.
ChEMBL_980998 (CHEMBL2427719)
IC50
1800±n/a nM
Citation
 Artese, ACosta, GDistinto, SMoraca, FOrtuso, FParrotta, LAlcaro, S Toward the design of new DNA G-quadruplex ligands through rational analysis of polymorphism and binding data. Eur J Med Chem 68:139-49 (2013)  
Target
Name:
Telomerase reverse transcriptase
Synonyms:
EST2 TERT TRT
Type:
PROTEIN
Mol. Mass.:
127099.03
Organism:
Homo sapiens (Human)
Description:
ChEMBL_1447029
Residue:
1132
  
Inhibitor
Name:
BDBM50068304
Synonyms:
CHEMBL343445 | N-[9,10-Dioxo-6-(3-pyrrolidin-1-yl-propionylamino)-9,10-dihydro-anthracen-2-yl]-3-pyrrolidin-1-yl-propionamide
Type:
Small organic molecule
Emp. Form.:
C28H32N4O4
Mol. Mass.:
488.5781
SMILES:
O=C(CCN1CCCC1)Nc1ccc2C(=O)c3cc(NC(=O)CCN4CCCC4)ccc3C(=O)c2c1
: