Target
Telomerase reverse transcriptase
Ligand
BDBM50440385
Substrate
Meas. Tech.
ChEMBL_980998 (CHEMBL2427719)
IC50
1300±n/a nM
Citation
 Artese, ACosta, GDistinto, SMoraca, FOrtuso, FParrotta, LAlcaro, S Toward the design of new DNA G-quadruplex ligands through rational analysis of polymorphism and binding data. Eur J Med Chem 68:139-49 (2013)  
Target
Name:
Telomerase reverse transcriptase
Synonyms:
EST2 TERT TRT
Type:
PROTEIN
Mol. Mass.:
127099.03
Organism:
Homo sapiens (Human)
Description:
ChEMBL_1447029
Residue:
1132
  
Inhibitor
Name:
BDBM50440385
Synonyms:
CHEMBL2425363
Type:
Small organic molecule
Emp. Form.:
C31H31N5O2
Mol. Mass.:
505.609
SMILES:
Cc1cc[n+](CCC(=O)Nc2ccc3nc4ccc(NC(=O)CC[n+]5ccc(C)cc5)cc4cc3c2)cc1
: