Target
Telomerase reverse transcriptase
Ligand
BDBM50176906
Substrate
Meas. Tech.
ChEMBL_980998 (CHEMBL2427719)
IC50
440±n/a nM
Citation
 Artese, ACosta, GDistinto, SMoraca, FOrtuso, FParrotta, LAlcaro, S Toward the design of new DNA G-quadruplex ligands through rational analysis of polymorphism and binding data. Eur J Med Chem 68:139-49 (2013)  
Target
Name:
Telomerase reverse transcriptase
Synonyms:
EST2 TERT TRT
Type:
PROTEIN
Mol. Mass.:
127099.03
Organism:
Homo sapiens (Human)
Description:
ChEMBL_1447029
Residue:
1132
  
Inhibitor
Name:
BDBM50176906
Synonyms:
CHEMBL219728 N-(3-(dimethylamino)propyl)-10H-indolo[3,2-b]quinolin-11-amine | N1-(10H-indolo[3,2-b]quinolin-11-yl)-N3,N3-dimethylpropane-1,3-diamine
Type:
Small organic molecule
Emp. Form.:
C20H22N4
Mol. Mass.:
318.4155
SMILES:
CN(C)CCCNc1c2[nH]c3ccccc3c2nc2ccccc12
: