Target
Cyclin-dependent kinase 5 activator 1
Ligand
BDBM50440473
Substrate
Meas. Tech.
ChEMBL_982819 (CHEMBL2429196)
IC50
560±n/a nM
Citation
 Boschi, DTosco, PChandra, NChaurasia, SFruttero, RGriffin, RWang, LZGasco, A 6-Cyclohexylmethoxy-5-(cyano-NNO-azoxy)pyrimidine-4-amine: a new scaffold endowed with potent CDK2 inhibitory activity. Eur J Med Chem 68:333-8 (2013)  
Target
Name:
Cyclin-dependent kinase 5 activator 1
Synonyms:
CDK5/p35 Cyclin-dependent kinase 5 regulatory subunit 1 | Cyclin-dependent kinase 5/CDK5 activator 1
Type:
Protein Complex
Mol. Mass.:
Description:
Components:
This complex has 2 components.
Component 1
Name:
Cyclin-dependent kinase 5
Synonyms:
CDK5 CDKN5 Cyclin-dependent kinase 5 (CDK5/ p25) Cyclin-dependent-like kinase 5 PSSALRE Tau protein kinase II catalytic subunit
Type:
Enzyme Subunit
Mol. Mass.:
33308.61
Organism:
Homo sapiens (Human)
Description:
Residue:
292
  
Component 2
Name:
Cyclin-dependent kinase 5 activator 1
Synonyms:
CD5R1_HUMAN CDK5R1 Cyclin-dependent kinase 5 (CDK5/p25) NCK5A p35
Type:
Enzyme Subunit
Mol. Mass.:
34077.43
Organism:
Homo sapiens (Human)
Description:
Q15078
Residue:
307
  
Inhibitor
Name:
BDBM50440473
Synonyms:
CHEMBL2425904
Type:
Small organic molecule
Emp. Form.:
C20H26N8O5S
Mol. Mass.:
490.536
SMILES:
Nc1nc(Nc2ccc(cc2)S(=O)(=O)NCCO)nc(OCC2CCCCC2)c1[N+](=O)[N-]C#N
: