Target
Cyclin-T1/Cyclin-dependent kinase 9
Ligand
BDBM50440474
Substrate
Meas. Tech.
ChEMBL_982820 (CHEMBL2429197)
IC50
1660±n/a nM
Citation
 Boschi, DTosco, PChandra, NChaurasia, SFruttero, RGriffin, RWang, LZGasco, A 6-Cyclohexylmethoxy-5-(cyano-NNO-azoxy)pyrimidine-4-amine: a new scaffold endowed with potent CDK2 inhibitory activity. Eur J Med Chem 68:333-8 (2013)  
Target
Name:
Cyclin-T1/Cyclin-dependent kinase 9
Synonyms:
CDK9/ Cyclin-T1 CDK9/Cyclin T Cyclin T1/dependent kinase 9 | Cyclin-Dependent Kinase 9 (CDK9)
Type:
Protein Complex
Mol. Mass.:
Description:
Components:
This complex has 2 components.
Component 1
Name:
Cyclin-T1
Synonyms:
CCNT1 CycT Cyclin T Cyclin-T
Type:
Enzyme Subunit
Mol. Mass.:
80712.40
Organism:
Homo sapiens (Human)
Description:
Residue:
726
  
Component 2
Name:
Cyclin-dependent kinase 9
Synonyms:
C-2K CDK9 Cell division cycle 2-like protein kinase 4 Cyclin-Dependent Kinase 9 (CDK9) Serine/threonine-protein kinase PITALRE Tat-associated kinase complex catalytic subunit
Type:
Enzyme Subunit
Mol. Mass.:
42789.13
Organism:
Homo sapiens (Human)
Description:
Residue:
372
  
Inhibitor
Name:
BDBM50440474
Synonyms:
CHEMBL2425903
Type:
Small organic molecule
Emp. Form.:
C19H24N8O4S
Mol. Mass.:
460.51
SMILES:
CNS(=O)(=O)c1ccc(Nc2nc(N)c(c(OCC3CCCCC3)n2)[N+](=O)[N-]C#N)cc1
: