Target
Cyclin-dependent kinase/G2/mitotic-specific cyclin- 1
Ligand
BDBM5566
Substrate
Meas. Tech.
ChEMBL_982825 (CHEMBL2429202)
IC50
2900±n/a nM
Citation
 Boschi, DTosco, PChandra, NChaurasia, SFruttero, RGriffin, RWang, LZGasco, A 6-Cyclohexylmethoxy-5-(cyano-NNO-azoxy)pyrimidine-4-amine: a new scaffold endowed with potent CDK2 inhibitory activity. Eur J Med Chem 68:333-8 (2013)  
Target
Name:
Cyclin-dependent kinase/G2/mitotic-specific cyclin- 1
Synonyms:
CDK1/B CDK1/CyclinB Cyclin-Dependent Kinase 1 (CDK1) Cyclin-dependent kinase/G2/mitotic-specific cyclin 1 | cdk1
Type:
Protein Complex
Mol. Mass.:
Description:
CDK1/Cyclin B complexes were purified from insect cells co-infected with baculovirus vectors containing each of the components.
Components:
This complex has 2 components.
Component 1
Name:
Cyclin-dependent kinase 1
Synonyms:
CDC2 CDK1 CDKN1 Cell division protein kinase 1 P34CDC2 | p34 protein kinase
Type:
Enzyme Subunit
Mol. Mass.:
34101.08
Organism:
Homo sapiens (Human)
Description:
P06493
Residue:
297
  
Component 2
Name:
G2/mitotic-specific cyclin-B1
Synonyms:
CCNB CCNB1_HUMAN
Type:
Enzyme Subunit
Mol. Mass.:
48340.95
Organism:
Homo sapiens (Human)
Description:
P14635
Residue:
433
  
Inhibitor
Name:
BDBM5566
Synonyms:
2,6-Diamino-4-cyclohexylmethoxy-5-nitrosopyrimidine NU6027 | pyrimidine deriv.
Type:
Small organic molecule
Emp. Form.:
C11H17N5O2
Mol. Mass.:
251.285
SMILES:
Nc1nc(N)c(N=O)c(OCC2CCCCC2)n1
: