Target
Bromodomain-containing protein 4
Ligand
BDBM50380682
Substrate
Meas. Tech.
ChEMBL_986179 (CHEMBL2433084)
IC50
130±n/a nM
Citation
 Gehling, VSHewitt, MCVaswani, RGLeblanc, YCôté, ANasveschuk, CGTaylor, AMHarmange, JCAudia, JEPardo, EJoshi, SSandy, PMertz, JASims, RJBergeron, LBryant, BMBellon, SPoy, FJayaram, HSankaranarayanan, RYellapantula, SBangalore Srinivasamurthy, NBirudukota, SAlbrecht, BK Discovery, Design, and Optimization of Isoxazole Azepine BET Inhibitors. ACS Med Chem Lett 4:835-40 (2013)  
Target
Name:
Bromodomain-containing protein 4
Synonyms:
BRD4 Bromodomain-containing protein 4 (BRD4) Protein HUNK1
Type:
Protein
Mol. Mass.:
152264.84
Organism:
Homo sapiens (Human)
Description:
O60885
Residue:
1362
  
Inhibitor
Name:
BDBM50380682
Synonyms:
CHEMBL2017291 | I-BET151 (16)
Type:
Small organic molecule
Emp. Form.:
C23H21N5O3
Mol. Mass.:
415.4445
SMILES:
COc1cc2c3n([C@H](C)c4ccccn4)c(=O)[nH]c3cnc2cc1-c1c(C)noc1C
: