Target
Bromodomain-containing protein 4
Ligand
BDBM50440725
Substrate
Meas. Tech.
ChEMBL_986179 (CHEMBL2433084)
IC50
1900±n/a nM
Citation
 Gehling, VSHewitt, MCVaswani, RGLeblanc, YCôté, ANasveschuk, CGTaylor, AMHarmange, JCAudia, JEPardo, EJoshi, SSandy, PMertz, JASims, RJBergeron, LBryant, BMBellon, SPoy, FJayaram, HSankaranarayanan, RYellapantula, SBangalore Srinivasamurthy, NBirudukota, SAlbrecht, BK Discovery, Design, and Optimization of Isoxazole Azepine BET Inhibitors. ACS Med Chem Lett 4:835-40 (2013)  
Target
Name:
Bromodomain-containing protein 4
Synonyms:
BRD4 Bromodomain-containing protein 4 (BRD4) Protein HUNK1
Type:
Protein
Mol. Mass.:
152264.84
Organism:
Homo sapiens (Human)
Description:
O60885
Residue:
1362
  
Inhibitor
Name:
BDBM50440725
Synonyms:
CHEMBL2431093
Type:
Small organic molecule
Emp. Form.:
C21H20ClN3O3S
Mol. Mass.:
429.92
SMILES:
COC(=O)NC[C@@H]1N=C(c2c(C)c(C)sc2-c2c(C)noc12)c1ccc(Cl)cc1
: