Target
Bromodomain-containing protein 4
Ligand
BDBM50440736
Substrate
Meas. Tech.
ChEMBL_986181 (CHEMBL2433086)
IC50
33000±n/a nM
Citation
 Gehling, VSHewitt, MCVaswani, RGLeblanc, YCôté, ANasveschuk, CGTaylor, AMHarmange, JCAudia, JEPardo, EJoshi, SSandy, PMertz, JASims, RJBergeron, LBryant, BMBellon, SPoy, FJayaram, HSankaranarayanan, RYellapantula, SBangalore Srinivasamurthy, NBirudukota, SAlbrecht, BK Discovery, Design, and Optimization of Isoxazole Azepine BET Inhibitors. ACS Med Chem Lett 4:835-40 (2013)  
Target
Name:
Bromodomain-containing protein 4
Synonyms:
BRD4 Bromodomain-containing protein 4 (BRD4) Protein HUNK1
Type:
Protein
Mol. Mass.:
152264.84
Organism:
Homo sapiens (Human)
Description:
O60885
Residue:
1362
  
Inhibitor
Name:
BDBM50440736
Synonyms:
CHEMBL2431088
Type:
Small organic molecule
Emp. Form.:
C10H10N2O
Mol. Mass.:
174.1992
SMILES:
Cc1noc(N)c1-c1ccccc1
: