Target
Receptor-type tyrosine-protein phosphatase F
Ligand
BDBM50441296
Substrate
Meas. Tech.
ChEMBL_984914 (CHEMBL2432853)
Ki
390000±n/a nM
Citation
 Baguley, TDXu, HCChatterjee, MNairn, ACLombroso, PJEllman, JA Substrate-based fragment identification for the development of selective, nonpeptidic inhibitors of striatal-enriched protein tyrosine phosphatase. J Med Chem 56:7636-50 (2013)  
Target
Name:
Receptor-type tyrosine-protein phosphatase F
Synonyms:
LAR Leukocyte common antigen related (LAR) PTPRF_HUMAN Receptor-type tyrosine-protein phosphatase F (LAR)
Type:
Protein
Mol. Mass.:
212869.85
Organism:
Homo sapiens (Human)
Description:
P10586
Residue:
1907
  
Inhibitor
Name:
BDBM50441296
Synonyms:
CHEMBL2431665 | CHEMBL2431667
Type:
Small organic molecule
Emp. Form.:
C20H17Cl2O5P
Mol. Mass.:
439.226
SMILES:
O[C@@H](c1cccc(c1)-c1ccc(cc1)C(=O)P(O)(O)O)c1ccc(Cl)c(Cl)c1
: