Target
Tyrosine-protein phosphatase non-receptor type 5
Ligand
BDBM50441322
Substrate
Meas. Tech.
ChEMBL_984912 (CHEMBL2432851)
Ki
25000±n/a nM
Citation
 Baguley, TDXu, HCChatterjee, MNairn, ACLombroso, PJEllman, JA Substrate-based fragment identification for the development of selective, nonpeptidic inhibitors of striatal-enriched protein tyrosine phosphatase. J Med Chem 56:7636-50 (2013)  
Target
Name:
Tyrosine-protein phosphatase non-receptor type 5
Synonyms:
PTN5_HUMAN Tyrosine-protein phosphatase non-receptor type 5 | Tyrosine-protein phosphatase non-receptor type 5 isoform a
Type:
Enzyme Catalytic Domain
Mol. Mass.:
63510.68
Organism:
Homo sapiens (Human)
Description:
gi_90652859
Residue:
565
  
Inhibitor
Name:
BDBM50441322
Synonyms:
CHEMBL2431707
Type:
Small organic molecule
Emp. Form.:
C18H19F2O4P
Mol. Mass.:
368.3116
SMILES:
Oc1c(cccc1-c1cccc(c1)C(F)(F)P(O)(O)=O)C1CCCC1
: