Target
Tyrosine-protein phosphatase non-receptor type 5
Ligand
BDBM50441326
Substrate
Meas. Tech.
ChEMBL_984912 (CHEMBL2432851)
Ki
95000±n/a nM
Citation
 Baguley, TDXu, HCChatterjee, MNairn, ACLombroso, PJEllman, JA Substrate-based fragment identification for the development of selective, nonpeptidic inhibitors of striatal-enriched protein tyrosine phosphatase. J Med Chem 56:7636-50 (2013)  
Target
Name:
Tyrosine-protein phosphatase non-receptor type 5
Synonyms:
PTN5_HUMAN Tyrosine-protein phosphatase non-receptor type 5 | Tyrosine-protein phosphatase non-receptor type 5 isoform a
Type:
Enzyme Catalytic Domain
Mol. Mass.:
63510.68
Organism:
Homo sapiens (Human)
Description:
gi_90652859
Residue:
565
  
Inhibitor
Name:
BDBM50441326
Synonyms:
CHEMBL2431703
Type:
Small organic molecule
Emp. Form.:
C16H17F2O4P
Mol. Mass.:
342.2743
SMILES:
CC(C)c1ccc(O)c(c1)-c1cccc(c1)C(F)(F)P(O)(O)=O
: