Target
Sigma non-opioid intracellular receptor 1
Ligand
BDBM50441458
Substrate
Meas. Tech.
ChEMBL_988325 (CHEMBL2439891)
Ki
6146±n/a nM
Citation
 Dukat, MAlix, KWorsham, JKhatri, SSchulte, MK 2-Amino-6-chloro-3,4-dihydroquinazoline: A novel 5-HT3 receptor antagonist with antidepressant character. Bioorg Med Chem Lett 23:5945-8 (2013)  
Target
Name:
Sigma non-opioid intracellular receptor 1
Synonyms:
OPRS1 SIGMAR1 Sigma non-opioid intracellular receptor 1 Sigma1-receptor Sterol isomerase-like protein
Type:
Protein
Mol. Mass.:
25307.17
Organism:
Cavia porcellus (Guinea pig)
Description:
Q60492
Residue:
223
  
Inhibitor
Name:
BDBM50441458
Synonyms:
CHEMBL2436555
Type:
Small organic molecule
Emp. Form.:
C8H8ClN3
Mol. Mass.:
181.622
SMILES:
NC1=NCc2cc(Cl)ccc2N1
: