Target
Egl nine homolog 1
Ligand
BDBM50441534
Substrate
Meas. Tech.
ChEMBL_988611 (CHEMBL2438562)
IC50
45500±n/a nM
Citation
 Hong, YRKim, HTLee, SCRo, SCho, JMKim, ISJung, YH [(4-Hydroxyl-benzo[4,5]thieno[3,2-c]pyridine-3-carbonyl)-amino]-acetic acid derivatives; HIF prolyl 4-hydroxylase inhibitors as oral erythropoietin secretagogues. Bioorg Med Chem Lett 23:5953-7 (2013)  
Target
Name:
Egl nine homolog 1
Synonyms:
C1orf12 EGLN1_HUMAN Hypoxia-inducible factor prolyl hydroxylase 2 (HIF-PH2) Prolyl hydroxylase domain-containing protein 2 (PHD2)
Type:
Protein
Mol. Mass.:
46035.59
Organism:
Homo sapiens (Human)
Description:
Q9GZT9
Residue:
426
  
Inhibitor
Name:
BDBM50441534
Synonyms:
CHEMBL2436934
Type:
Small organic molecule
Emp. Form.:
C14H10N2O5
Mol. Mass.:
286.2396
SMILES:
OC(=O)CNC(=O)c1ncc2c3ccccc3oc2c1O
: