Target
Inhibitor of nuclear factor kappa-B kinase subunit beta
Ligand
BDBM50441566
Substrate
Meas. Tech.
ChEMBL_988772 (CHEMBL2439145)
IC50
288±n/a nM
Citation
 Goodfellow, VSLoweth, CJRavula, SBWiemann, TNguyen, TXu, YTodd, DESheppard, DPollack, SPolesskaya, OMarker, DFDewhurst, SGelbard, HA Discovery, synthesis, and characterization of an orally bioavailable, brain penetrant inhibitor of mixed lineage kinase 3. J Med Chem 56:8032-48 (2013)  
Target
Name:
Inhibitor of nuclear factor kappa-B kinase subunit beta
Synonyms:
I-kappa-B Kinase 2 (IKK-beta) I-kappa-B-kinase beta IKBKB IKK-beta IKK2/IKK1 IKKB_HUMAN Inhibitor of nuclear factor kappa B kinase beta subunit Nuclear factor NF-kappa-B inhibitor kinase beta
Type:
Serine/threonine-protein kinase
Mol. Mass.:
86554.39
Organism:
Homo sapiens (Human)
Description:
GST-tagged IKK-2 was expressed in High Five cells and purified.
Residue:
756
  
Inhibitor
Name:
BDBM50441566
Synonyms:
CHEMBL2436977 | US10485800, Example 179
Type:
Small organic molecule
Emp. Form.:
C26H26N6
Mol. Mass.:
422.5248
SMILES:
CN1CCN(Cc2ccc(cc2)-c2cnc3[nH]cc(-c4cnc5[nH]ccc5c4)c3c2)CC1
: