Target
Cytochrome P450 2D6
Ligand
BDBM50441569
Substrate
Meas. Tech.
ChEMBL_988940 (CHEMBL2439900)
IC50
3700±n/a nM
Citation
 Goodfellow, VSLoweth, CJRavula, SBWiemann, TNguyen, TXu, YTodd, DESheppard, DPollack, SPolesskaya, OMarker, DFDewhurst, SGelbard, HA Discovery, synthesis, and characterization of an orally bioavailable, brain penetrant inhibitor of mixed lineage kinase 3. J Med Chem 56:8032-48 (2013)  
Target
Name:
Cytochrome P450 2D6
Synonyms:
CP2D6_HUMAN CYP2DL1 Cytochrome P450 2D6 (CYP2D6) P450-DB1
Type:
Protein
Mol. Mass.:
55774.82
Organism:
Homo sapiens (Human)
Description:
P10635
Residue:
497
  
Inhibitor
Name:
BDBM50441569
Synonyms:
CHEMBL2436981 US9814704, Example 4
Type:
Small organic molecule
Emp. Form.:
C20H15N5
Mol. Mass.:
325.3666
SMILES:
Nc1ccc(cn1)-c1cnc2[nH]cc(-c3ccc4[nH]ccc4c3)c2c1
: