Target
Neuropeptide Y receptor type 4
Ligand
BDBM50441960
Substrate
Meas. Tech.
ChEMBL_992058 (CHEMBL2447701)
EC50
76±n/a nM
Citation
 Berlicki, LKaske, MGutièrrez-Abad, RBernhardt, GIlla, OOrtuno, RMCabrele, CBuschauer, AReiser, O Replacement of Thr32 and Gln34 in the C-terminal neuropeptide Y fragment 25-36 by cis-cyclobutane and cis-cyclopentane β-amino acids shifts selectivity toward the Y(4) receptor. J Med Chem 56:8422-31 (2013)  
Target
Name:
Neuropeptide Y receptor type 4
Synonyms:
NPY-Y4 NPY4R PP1 Pancreatic polypeptide receptor 1
Type:
Enzyme Catalytic Domain
Mol. Mass.:
42207.58
Organism:
Homo sapiens (Human)
Description:
NPY-Y4 PPYR1 HUMAN::P50391
Residue:
375
  
Inhibitor
Name:
BDBM50441960
Synonyms:
CHEMBL2440197
Type:
Small organic molecule
Emp. Form.:
C73H119N27O18
Mol. Mass.:
1662.8961
SMILES:
[#6]-[#6]-[#6@H](-[#6])-[#6@H](-[#7]-[#6](=O)-[#6@H](-[#6]-c1ccc(-[#8])cc1)-[#7]-[#6](=O)-[#6@H](-[#6]-[#6]-[#6]\[#7]=[#6](/[#7])-[#7])-[#7]-[#6](=O)-[#6@H](-[#6]-[#6]-[#6]\[#7]=[#6](/[#7])-[#7])-[#7]-[#6](-[#6])=O)-[#6](=O)-[#7]-[#6@@H](-[#6]-[#6](-[#7])=O)-[#6](=O)-[#7]-[#6@@H](-[#6]-[#6](-[#7])=O)-[#6](=O)-[#7]-[#6@@H](-[#6]-[#6](-[#6])-[#6])-[#6](=O)-[#7]-[#6@@H](-[#6@@H](-[#6])-[#8])-[#6](=O)-[#7]-[#6@@H](-[#6]-[#6]-[#6]\[#7]=[#6](\[#7])-[#7])-[#6](=O)-[#7]-[#6@H]-1-[#6]-[#6]-[#6@H]-1-[#6](=O)-[#7]-[#6@@H](-[#6]-[#6]-[#6]\[#7]=[#6](/[#7])-[#7])-[#6](=O)-[#7]-[#6@@H](-[#6]-c1ccc(-[#8])cc1)-[#6](-[#7])=O
: