Target
Neuropeptide Y receptor type 5
Ligand
BDBM50441958
Substrate
Meas. Tech.
ChEMBL_992052 (CHEMBL2447453)
Ki
>1000±n/a nM
Citation
 Berlicki, LKaske, MGutièrrez-Abad, RBernhardt, GIlla, OOrtuno, RMCabrele, CBuschauer, AReiser, O Replacement of Thr32 and Gln34 in the C-terminal neuropeptide Y fragment 25-36 by cis-cyclobutane and cis-cyclopentane β-amino acids shifts selectivity toward the Y(4) receptor. J Med Chem 56:8422-31 (2013)  
Target
Name:
Neuropeptide Y receptor type 5
Synonyms:
NPY-Y5 NPY5-R NPY5R_HUMAN NPYY5 Neuropeptide Y receptor type 5 ( NPY Y5) | Y5 receptor
Type:
Enzyme
Mol. Mass.:
50746.64
Organism:
Homo sapiens (Human)
Description:
Q15761
Residue:
445
  
Inhibitor
Name:
BDBM50441958
Synonyms:
CHEMBL2440119
Type:
Small organic molecule
Emp. Form.:
C33H54N12O8
Mol. Mass.:
746.8575
SMILES:
C[C@@H](O)[C@H](NC(C)=O)C(=O)N[C@@H](CCCNC(N)=N)C(=O)N[C@H]1CCC[C@H]1C(=O)N[C@@H](CCCNC(N)=N)C(=O)N[C@@H](Cc1ccc(O)cc1)C(N)=O
: