Target
Histone-lysine N-methyltransferase EHMT2
Ligand
BDBM50442108
Substrate
Meas. Tech.
ChEMBL_992787 (CHEMBL2444214)
IC50
>50000±n/a nM
Citation
 Liu, FBarsyte-Lovejoy, DLi, FXiong, YKorboukh, VHuang, XPAllali-Hassani, AJanzen, WPRoth, BLFrye, SVArrowsmith, CHBrown, PJVedadi, MJin, J Discovery of an in vivo chemical probe of the lysine methyltransferases G9a and GLP. J Med Chem 56:8931-42 (2013)  
Target
Name:
Histone-lysine N-methyltransferase EHMT2
Synonyms:
BAT8 EHMT2 G9A Histone-lysine N-methyltransferase EHMT1/EHMT2 KMT1C Protein G9a (G9a)
Type:
Enzyme
Mol. Mass.:
132339.87
Organism:
Homo sapiens (Human)
Description:
Q96KQ7
Residue:
1210
  
Inhibitor
Name:
BDBM50442108
Synonyms:
CHEMBL2441074
Type:
Small organic molecule
Emp. Form.:
C30H45F2N5O3
Mol. Mass.:
561.7068
SMILES:
COc1cc2c(NC3CCN(CC3)C(C)C)nc(nc2cc1OCCCN1CCC(F)(F)CC1)C1CCOCC1
: