Target
Dipeptidyl peptidase 8
Ligand
BDBM50442193
Substrate
Meas. Tech.
ChEMBL_991618 (CHEMBL2444440)
Ki
1.000±n/a nM
Citation
 Devasthale, PWang, YWang, WFevig, JFeng, JWang, AHarrity, TEgan, DMorgan, NCap, MFura, AKlei, HEKish, KWeigelt, CSun, LLevesque, PMoulin, FLi, YXZahler, RKirby, MSHamann, LG Optimization of activity, selectivity, and liability profiles in 5-oxopyrrolopyridine DPP4 inhibitors leading to clinical candidate (Sa)-2-(3-(aminomethyl)-4-(2,4-dichlorophenyl)-2-methyl-5-oxo-5H-pyrrolo[3,4-b]pyridin-6(7H)-yl)-N,N-dimethylacetamide (BMS-767778). J Med Chem 56:7343-57 (2013)  
Target
Name:
Dipeptidyl peptidase 8
Synonyms:
DPP8 DPRP-1 Dipeptidyl peptidase 8 (DPP-8) Dipeptidyl peptidase 8/9 Dipeptidyl peptidase VIII Prolyl dipeptidase DPP8
Type:
Enzyme
Mol. Mass.:
103342.62
Organism:
Homo sapiens (Human)
Description:
Q6V1X1
Residue:
898
  
Inhibitor
Name:
BDBM50442193
Synonyms:
CHEMBL2441844
Type:
Small organic molecule
Emp. Form.:
C17H15Cl2N3O3
Mol. Mass.:
380.225
SMILES:
Cc1[nH]c2cn(CC(O)=O)c(=O)c2c(c1CN)-c1ccc(Cl)cc1Cl
: