Target
Tissue alpha-L-fucosidase
Ligand
BDBM50442349
Substrate
Meas. Tech.
ChEMBL_990950 (CHEMBL2445278)
IC50
1300±n/a nM
Citation
 Kato, AOkaki, TIfuku, SSato, KHirokami, YIwaki, RKamori, ANakagawa, SAdachi, IKiria, PGOnomura, OMinato, DSugimoto, KMatsuya, YToyooka, N Synthesis and biological evaluation of N-(2-fluorophenyl)-2ß-deoxyfuconojirimycin acetamide as a potent inhibitor fora-l-fucosidases. Bioorg Med Chem 21:6565-73 (2013)  
Target
Name:
Tissue alpha-L-fucosidase
Synonyms:
Alpha-L-fucosidase I Fuca | Fuca1
Type:
PROTEIN
Mol. Mass.:
53482.81
Organism:
Rattus norvegicus
Description:
ChEMBL_990950
Residue:
462
  
Inhibitor
Name:
BDBM50442349
Synonyms:
CHEMBL2442778
Type:
Small organic molecule
Emp. Form.:
C15H22N2O4
Mol. Mass.:
294.3462
SMILES:
C[C@@H]1N[C@H](CC(=O)NCc2ccccc2)[C@@H](O)[C@H](O)[C@@H]1O
: