Target
Transient receptor potential cation channel subfamily V member 1
Ligand
BDBM50398494
Substrate
Meas. Tech.
ChEMBL_991130 (CHEMBL2446586)
Ki
0.01±n/a nM
Citation
 Ha, THRyu, HKim, SEKim, HSAnn, JTran, PTHoang, VHSon, KCui, MChoi, SBlumberg, PMFrank, RBahrenberg, GSchiene, KChristoph, TFrormann, SLee, J TRPV1 antagonist with high analgesic efficacy: 2-Thio pyridine C-region analogues of 2-(3-fluoro-4-methylsulfonylaminophenyl)propanamides. Bioorg Med Chem 21:6657-64 (2013)  
Target
Name:
Transient receptor potential cation channel subfamily V member 1
Synonyms:
Capsaicin receptor Osm-9-like TRP channel 1 TRPV1_HUMAN Transient receptor potential cation channel subfamily V member 1 (TRPV1) Transient receptor potential cation channel subfamily V member 1(TRPV1) Vanilloid VR1 Vanilloid receptor 1 Vanilloid receptor 1 (VRI/TRPV1)
Type:
Protein
Mol. Mass.:
94960.75
Organism:
Homo sapiens (Human)
Description:
Q8NER1
Residue:
839
  
Inhibitor
Name:
BDBM50398494
Synonyms:
CHEMBL2177429
Type:
Small organic molecule
Emp. Form.:
C23H28F4N4O3S
Mol. Mass.:
516.552
SMILES:
C[C@H](C(=O)NCc1ccc(nc1N1CCC(C)CC1)C(F)(F)F)c1ccc(NS(C)(=O)=O)c(F)c1
: