Target
Aldo-keto reductase family 1 member B10
Ligand
BDBM50442503
Substrate
Meas. Tech.
ChEMBL_990162 (CHEMBL2444357)
IC50
13±n/a nM
Citation
 Endo, SHu, DSuyama, MMatsunaga, TSugimoto, KMatsuya, YEl-Kabbani, OKuwata, KHara, AKitade, YToyooka, N Synthesis and structure-activity relationship of 2-phenyliminochromene derivatives as inhibitors for aldo-keto reductase (AKR) 1B10. Bioorg Med Chem 21:6378-84 (2013)  
Target
Name:
Aldo-keto reductase family 1 member B10
Synonyms:
AK1BA_HUMAN AKR1B11 ARP Aldo-keto reductase family 1 member B10 (AKR1B10) Aldose reductase-like SI reductase hARP
Type:
Protein
Mol. Mass.:
36024.67
Organism:
Homo sapiens (Human)
Description:
O60218. 1ZUA; 4JII; 4GQ0
Residue:
316
  
Inhibitor
Name:
BDBM50442503
Synonyms:
CHEMBL2440427
Type:
Small organic molecule
Emp. Form.:
C23H17N3O5
Mol. Mass.:
415.3982
SMILES:
OC(=O)Cc1ccc(cc1)\N=c1/oc2cc(O)ccc2cc1C(=O)Nc1ccccn1
: