Target
Neuropeptide Y receptor type 5
Ligand
BDBM50442566
Substrate
Meas. Tech.
ChEMBL_990500 (CHEMBL2446797)
Ki
>5000±n/a nM
Citation
 Keller, MKaske, MHolzammer, TBernhardt, GBuschauer, A Dimeric argininamide-type neuropeptide Y receptor antagonists: chiral discrimination between Y1 and Y4 receptors. Bioorg Med Chem 21:6303-22 (2013)  
Target
Name:
Neuropeptide Y receptor type 5
Synonyms:
NPY-Y5 NPY5-R NPY5R_HUMAN NPYY5 Neuropeptide Y receptor type 5 ( NPY Y5) | Y5 receptor
Type:
Enzyme
Mol. Mass.:
50746.64
Organism:
Homo sapiens (Human)
Description:
Q15761
Residue:
445
  
Inhibitor
Name:
BDBM50442566
Synonyms:
CHEMBL2440905
Type:
Small organic molecule
Emp. Form.:
C44H61N13O8
Mol. Mass.:
900.0374
SMILES:
NCCNC(=O)CCC(=O)NCCNC(=O)CCC(=O)NCCNC(=O)NC(N)=NCCC[C@H](NC(=O)C(c1ccccc1)c1ccccc1)C(=O)NCc1ccc(CNC(N)=O)cc1
: