Target
Neuropeptide Y receptor type 2
Ligand
BDBM50442573
Substrate
Meas. Tech.
ChEMBL_990503 (CHEMBL2446800)
Ki
4000±n/a nM
Citation
 Keller, MKaske, MHolzammer, TBernhardt, GBuschauer, A Dimeric argininamide-type neuropeptide Y receptor antagonists: chiral discrimination between Y1 and Y4 receptors. Bioorg Med Chem 21:6303-22 (2013)  
Target
Name:
Neuropeptide Y receptor type 2
Synonyms:
NPY-Y2 NPY2-R NPY2R_HUMAN Y2 receptor | neuropeptide Y receptor Y2
Type:
Enzyme Catalytic Domain
Mol. Mass.:
42734.65
Organism:
Homo sapiens (Human)
Description:
NPY-Y2 NPY2R HUMAN::P49146
Residue:
381
  
Inhibitor
Name:
BDBM50442573
Synonyms:
CHEMBL2440911
Type:
Small organic molecule
Emp. Form.:
C86H120N22O16
Mol. Mass.:
1718.0108
SMILES:
NCCN(CCNC(=O)CCC(=O)NCCOCCOCCNC(=O)NC(=N)NCCC[C@@H](NC(=O)C(c1ccccc1)c1ccccc1)C(=O)NCc1ccc(CNC(N)=O)cc1)CCNC(=O)CCC(=O)NCCOCCOCCNC(=O)NC(N)=NCCC[C@@H](NC(=O)C(c1ccccc1)c1ccccc1)C(=O)NCc1ccc(CNC(N)=O)cc1
: