Target
Neuropeptide Y receptor type 4
Ligand
BDBM50442571
Substrate
Meas. Tech.
ChEMBL_990501 (CHEMBL2446798)
Ki
3700±n/a nM
Citation
 Keller, MKaske, MHolzammer, TBernhardt, GBuschauer, A Dimeric argininamide-type neuropeptide Y receptor antagonists: chiral discrimination between Y1 and Y4 receptors. Bioorg Med Chem 21:6303-22 (2013)  
Target
Name:
Neuropeptide Y receptor type 4
Synonyms:
NPY-Y4 NPY4R PP1 Pancreatic polypeptide receptor 1
Type:
Enzyme Catalytic Domain
Mol. Mass.:
42207.58
Organism:
Homo sapiens (Human)
Description:
NPY-Y4 PPYR1 HUMAN::P50391
Residue:
375
  
Inhibitor
Name:
BDBM50442571
Synonyms:
CHEMBL2440897
Type:
Small organic molecule
Emp. Form.:
C45H65N11O9
Mol. Mass.:
904.0659
SMILES:
NCCCOCCOCCOCCNC(=O)CCC(=O)NCCNC(=O)NC(N)=NCCC[C@H](NC(=O)C(c1ccccc1)c1ccccc1)C(=O)NCc1ccc(CNC(N)=O)cc1
: