Target
Substance-P receptor
Ligand
BDBM50442589
Substrate
Meas. Tech.
ChEMBL_990570 (CHEMBL2447345)
Ki
0.138000±n/a nM
Citation
 Di Fabio, RAlvaro, GBraggio, SCarletti, RGerrard, PAGriffante, CMarchioro, CPozzan, AMelotto, SPoffe, APiccoli, LRatti, ETranquillini, ETrower, MSpada, SCorsi, M Identification, biological characterization and pharmacophoric analysis of a new potent and selective NK1 receptor antagonist clinical candidate. Bioorg Med Chem 21:6264-73 (2013)  
Target
Name:
Substance-P receptor
Synonyms:
NK-1 receptor NK1 Receptor NK1R_HUMAN Neurokinin-1 (NK-1) SPR TACR1 Tachykinin receptor 1 (NK1) | tachykinin
Type:
G Protein-Coupled Receptor (GPCR)
Mol. Mass.:
46254.43
Organism:
Homo sapiens (Human)
Description:
P25103
Residue:
407
  
Inhibitor
Name:
BDBM50442589
Synonyms:
CHEMBL2441371
Type:
Small organic molecule
Emp. Form.:
C31H35F7N4O2
Mol. Mass.:
628.624
SMILES:
C[C@@H](N(C)C(=O)N1CC[C@H](C[C@@H]1c1ccc(F)cc1C)N1CCN2[C@H](CCC2=O)C1)c1cc(cc(c1)C(F)(F)F)C(F)(F)F
: