Target
Solute carrier organic anion transporter family member 1B1
Ligand
BDBM50294526
Substrate
Meas. Tech.
ChEMBL_1265863 (CHEMBL3039489)
IC50
724±n/a nM
Citation
 De Bruyn, Tvan Westen, GJIjzerman, APStieger, Bde Witte, PAugustijns, PFAnnaert, PP Structure-based identification of OATP1B1/3 inhibitors. Mol Pharmacol 83:1257-67 (2013)  
Target
Name:
Solute carrier organic anion transporter family member 1B1
Synonyms:
LST1 OATP2 SLC21A6 SO1B1_HUMAN Solute carrier organic anion transporter family member 1B1 (OATP1B1) | Thromboxane B2
Type:
Protein
Mol. Mass.:
76468.06
Organism:
Homo sapiens (Human)
Description:
Q9Y6L6
Residue:
691
  
Inhibitor
Name:
BDBM50294526
Synonyms:
CHEMBL551842 lobaric acid
Type:
Small organic molecule
Emp. Form.:
C25H28O8
Mol. Mass.:
456.485
SMILES:
CCCCCc1c2Oc3cc(OC)cc(C(=O)CCCC)c3C(=O)Oc2cc(O)c1C(O)=O
: