Target
Solute carrier organic anion transporter family member 1B3
Ligand
BDBM50294526
Substrate
Meas. Tech.
ChEMBL_1265866 (CHEMBL3039492)
IC50
1622±n/a nM
Citation
 De Bruyn, Tvan Westen, GJIjzerman, APStieger, Bde Witte, PAugustijns, PFAnnaert, PP Structure-based identification of OATP1B1/3 inhibitors. Mol Pharmacol 83:1257-67 (2013)  
Target
Name:
Solute carrier organic anion transporter family member 1B3
Synonyms:
LST2 OATP8 SLC21A8 SO1B3_HUMAN Solute carrier organic anion transporter family member 1B3 (OATP1B3)
Type:
Protein
Mol. Mass.:
77425.75
Organism:
Homo sapiens (Human)
Description:
Q9NPD5
Residue:
702
  
Inhibitor
Name:
BDBM50294526
Synonyms:
CHEMBL551842 lobaric acid
Type:
Small organic molecule
Emp. Form.:
C25H28O8
Mol. Mass.:
456.485
SMILES:
CCCCCc1c2Oc3cc(OC)cc(C(=O)CCCC)c3C(=O)Oc2cc(O)c1C(O)=O
: